{"text_format":"1","workbook":"xlsx","n_sheets":10,"sheets":["Kalkulačka","Zdroje","CF","Data","Predpoklady","Emisie","Grafy","Pomocné tabuľky","Hárok1","Hárok2"],"not_rendered":{"charts":19,"images":2,"macros":1,"external_links":0,"defined_names":20,"comments":1,"pivot_tables":1},"unopened":[],"bounds":{"document_bytes":16777216,"sheet_cells":100000,"rows_first":2000,"rows_last":500,"rows_between":2000,"halvings":0,"cell_chars":16384,"cell_head_chars":4096},"cells_cut":0,"cells_raw":0,"read":"whole","date_system":"1900"}

{"sheet":"Kalkulačka","index":0,"n_rows":37,"n_cols":14,"rows_kept":37,"cut":false,"hidden":false,"merged":[[1,1,1,3],[1,5,1,7],[36,1,36,7],[23,1,23,3],[23,5,23,7]]}
[]
[null,"Vyber pár dvoch áut na porovnanie",null,null,null,"Nastav základné predpoklady modelu"]
[null,"Trieda","Stredná","Stredná",null,"Ročný počet najazdených kilometrov",null,15000,null,null,null,null,null,15000]
[null,"Pohon","Elektromobily","Spaľovanie",null,"Cena benzínu za liter (eur)",null,1.3340000000000001,null,null,null,null,null,1.3340000000000001]
[null,"Model","Mercedes B 250e","Mercedes B 250",null,"Cena nafty za liter (eur)",null,1.2410000000000001,null,null,null,null,null,1.2410000000000001]
[null,"Výkon v kW",{"$f":"VLOOKUP(C5,Data!$F$2:$N$135,7,FALSE)","v":132},{"$f":"VLOOKUP(D5,Data!$F$2:$N$135,7,FALSE)","v":155},null,"Cena elektriny za kilowatthodinu (eur)",null,0.14824999999999999,null,null,null,null,null,0.14824999999999999]
[null,"Rok uvedenia modelu",{"$f":"VLOOKUP(C5,Data!$F$2:$G$135,2,FALSE)","v":2015},{"$f":"VLOOKUP(D5,Data!$F$2:$G$135,2,FALSE)","v":2014},null,"Reálna diskontná miera",null,0.04,null,null,null,null,null,0.04]
[null,"Dojazd automobilu v km",{"$f":"VLOOKUP(Kalkulačka!C5,Data!$F$2:$P$135,11,FALSE)","v":155.55555555555557},{"$f":"VLOOKUP(Kalkulačka!D5,Data!$F$2:$P$135,11,FALSE)","v":595.2380952380953},null,"Dotácia pre elektromobil alebo hybrid",null,0,null,null,null,null,null,0]
{"$rows_left_out":30}
{"sheet":"Zdroje","index":1,"n_rows":7,"n_cols":32,"rows_kept":7,"cut":false,"hidden":false,"merged":[]}
["Zdroje:"]
["Databáza obsahuje všetky predávané autá na elektrický a hybridný pohon na Slovensku a okrem ostatných aj TOP15 najpredávanejších áut so spaľovacím motorom za rok 2017."]
["Údaje o cenách a technickej špecifikácii vozidiel pochádzajú zo stránok výrobcov a autorizovaných miestnych predajcov."]
["Náklady na údržbu pochádzajú zo štúdií Cost Analysis of Plug-in Hybrid Vehicles Including Maintenance & Repair Costs and Resale Values (Propfe, Redelbach, Santini, Friedrich, 2012), ",null,null,null,null,null,null,null,null,null,null,null,null,null,null,null,"Electric Vehicle Life Cycle Cost Analysis (Raustad, 2017)",null,null,null,null,null,"a Battery Electric Vehicles vs. Internal Combustion Vehicles (Brennan, Barder, 2016)."]
["Výška vyprodukovaných emisií bola prebraná zo štúdií Shades of Green (Wilson, 2013), ",null,null,null,null,null,null,null,"Comparative Study on Life Cycle CO2 Emissions from the Production of Electric and Conventional Vehicles in China (Qiao, Zhao, Liu, Hao, 2017)",null,null,null,null,null,null,null,null,null,null,null,"a From Laboratory to Road (Mock, German, Bandivadekar, Riemersma, Ligterink, Lambrecht, 2015)",null,null,null,null,null,null,null,null,null,null,", ale aj z hodnôt uvádzaných výrobcami "]
["Výška registračnej dane je vypočítaná podľa zákona NR SR č. 145/1995 Z.z. o správnych poplatkoch v znení neskorších predpisov."]
["Výška dotácie je voliteľná užívateľom. Dotácia poskytovaná MH SR od novembra 2016 do júna 2018 bola 5 000 eur pre autá s elektrickým motorom a 3 000 pre hybridy."]

{"sheet":"CF","index":2,"n_rows":130,"n_cols":18,"rows_kept":130,"cut":false,"hidden":false,"merged":[[71,0,79,0],[121,0,129,0],[111,0,119,0],[101,0,109,0],[91,0,99,0],[81,0,89,0],[1,0,9,0],[61,0,69,0],[51,0,59,0],[41,0,49,0],[31,0,39,0],[21,0,29,0],[11,0,19,0]]}
[null,null,0,1,2,3,4,5,6,7,8,9,10,11,12,13,14,15]
[{"$f":"Kalkulačka!C5","v":"Mercedes B 250e"},"Počet kilometrov",0,{"$f":"Kalkulačka!$H$3*D1","v":15000},{"$f":"Kalkulačka!$H$3*E1","v":30000},{"$f":"Kalkulačka!$H$3*F1","v":45000},{"$f":"Kalkulačka!$H$3*G1","v":60000},{"$f":"Kalkulačka!$H$3*H1","v":75000},{"$f":"Kalkulačka!$H$3*I1","v":90000},{"$f":"Kalkulačka!$H$3*J1","v":105000},{"$f":"Kalkulačka!$H$3*K1","v":120000},{"$f":"Kalkulačka!$H$3*L1","v":135000},{"$f":"Kalkulačka!$H$3*M1","v":150000},{"$f":"Kalkulačka!$H$3*N1","v":165000},{"$f":"Kalkulačka!$H$3*O1","v":180000},{"$f":"Kalkulačka!$H$3*P1","v":195000},{"$f":"Kalkulačka!$H$3*Q1","v":210000},{"$f":"Kalkulačka!$H$3*R1","v":225000}]
[null,"Celkové náklady v priebehu životnosti",{"$f":"SUM(C4:C9)","v":40833},{"$f":"SUM(D4:D9)","v":967.3125},{"$f":"SUM(E4:E9)","v":930.10817307692298},894.33478180473355,859.93729019685918,826.86277903544146,795.06036445715517,764.48111967034174,735.07799968302061,706.8057689259814,679.62093165959743,653.48166505730524,628.34775486279341,604.18053352191669,580.94282069415078,558.59886605206805]
[null,"Nákup auta",{"$f":"VLOOKUP(Kalkulačka!C5,Data!F1:I135,4,FALSE)","v":40800}]
[null,"Dotácia",{"$f":"-VLOOKUP(A2,Data!$F$2:$J$135,5,FALSE)","v":0}]
[null,"Registračná daň",{"$f":"VLOOKUP(Kalkulačka!C5,Data!F1:U135,16,FALSE)","v":33}]
[null,"Poistenie",null,{"$f":"VLOOKUP(Kalkulačka!$C$5,Data!$F$1:$AD$135,25,FALSE)/POWER(1+Kalkulačka!$H$7,D$1)","v":164.16346153846152},{"$f":"VLOOKUP(Kalkulačka!$C$5,Data!$F$1:$AD$135,25,FALSE)/POWER(1+Kalkulačka!$H$7,E$1)","v":157.84948224852067},{"$f":"VLOOKUP(Kalkulačka!$C$5,Data!$F$1:$AD$135,25,FALSE)/POWER(1+Kalkulačka!$H$7,F$1)","v":151.77834831588527},{"$f":"VLOOKUP(Kalkulačka!$C$5,Data!$F$1:$AD$135,25,FALSE)/POWER(1+Kalkulačka!$H$7,G$1)","v":145.94071953450506},{"$f":"VLOOKUP(Kalkulačka!$C$5,Data!$F$1:$AD$135,25,FALSE)/POWER(1+Kalkulačka!$H$7,H$1)","v":140.32761493702409},{"$f":"VLOOKUP(Kalkulačka!$C$5,Data!$F$1:$AD$135,25,FALSE)/POWER(1+Kalkulačka!$H$7,I$1)","v":134.93039897790777},{"$f":"VLOOKUP(Kalkulačka!$C$5,Data!$F$1:$AD$135,25,FALSE)/POWER(1+Kalkulačka!$H$7,J$1)","v":129.74076824798826},{"$f":"VLOOKUP(Kalkulačka!$C$5,Data!$F$1:$AD$135,25,FALSE)/POWER(1+Kalkulačka!$H$7,K$1)","v":124.75073869998869},{"$f":"VLOOKUP(Kalkulačka!$C$5,Data!$F$1:$AD$135,25,FALSE)/POWER(1+Kalkulačka!$H$7,L$1)","v":119.95263336537373},{"$f":"VLOOKUP(Kalkulačka!$C$5,Data!$F$1:$AD$135,25,FALSE)/POWER(1+Kalkulačka!$H$7,M$1)","v":115.33907054362858},{"$f":"VLOOKUP(Kalkulačka!$C$5,Data!$F$1:$AD$135,25,FALSE)/POWER(1+Kalkulačka!$H$7,N$1)","v":110.90295244579671},{"$f":"VLOOKUP(Kalkulačka!$C$5,Data!$F$1:$AD$135,25,FALSE)/POWER(1+Kalkulačka!$H$7,O$1)","v":106.63745427480451},{"$f":"VLOOKUP(Kalkulačka!$C$5,Data!$F$1:$AD$135,25,FALSE)/POWER(1+Kalkulačka!$H$7,P$1)","v":102.53601372577357},{"$f":"VLOOKUP(Kalkulačka!$C$5,Data!$F$1:$AD$135,25,FALSE)/POWER(1+Kalkulačka!$H$7,Q$1)","v":98.592320890166889},{"$f":"VLOOKUP(Kalkulačka!$C$5,Data!$F$1:$AD$135,25,FALSE)/POWER(1+Kalkulačka!$H$7,R$1)","v":94.800308548237396}]
[null,"Palivo",null,{"$f":"VLOOKUP(Kalkulačka!$C$5,Data!$F$1:$AD$135,15,FALSE)*Kalkulačka!$H$3/100000/POWER(1+Kalkulačka!$H$7,D1)","v":384.87980769230768},{"$f":"VLOOKUP(Kalkulačka!$C$5,Data!$F$1:$AD$135,15,FALSE)*Kalkulačka!$H$3/100000/POWER(1+Kalkulačka!$H$7,E1)","v":370.07673816568041},{"$f":"VLOOKUP(Kalkulačka!$C$5,Data!$F$1:$AD$135,15,FALSE)*Kalkulačka!$H$3/100000/POWER(1+Kalkulačka!$H$7,F1)","v":355.84301746700038},{"$f":"VLOOKUP(Kalkulačka!$C$5,Data!$F$1:$AD$135,15,FALSE)*Kalkulačka!$H$3/100000/POWER(1+Kalkulačka!$H$7,G1)","v":342.15674756442343},{"$f":"VLOOKUP(Kalkulačka!$C$5,Data!$F$1:$AD$135,15,FALSE)*Kalkulačka!$H$3/100000/POWER(1+Kalkulačka!$H$7,H1)","v":328.99687265809945},{"$f":"VLOOKUP(Kalkulačka!$C$5,Data!$F$1:$AD$135,15,FALSE)*Kalkulačka!$H$3/100000/POWER(1+Kalkulačka!$H$7,I1)","v":316.34314678663407},{"$f":"VLOOKUP(Kalkulačka!$C$5,Data!$F$1:$AD$135,15,FALSE)*Kalkulačka!$H$3/100000/POWER(1+Kalkulačka!$H$7,J1)","v":304.17610267945588},{"$f":"VLOOKUP(Kalkulačka!$C$5,Data!$F$1:$AD$135,15,FALSE)*Kalkulačka!$H$3/100000/POWER(1+Kalkulačka!$H$7,K1)","v":292.47702180716902},{"$f":"VLOOKUP(Kalkulačka!$C$5,Data!$F$1:$AD$135,15,FALSE)*Kalkulačka!$H$3/100000/POWER(1+Kalkulačka!$H$7,L1)","v":281.22790558381638},{"$f":"VLOOKUP(Kalkulačka!$C$5,Data!$F$1:$AD$135,15,FALSE)*Kalkulačka!$H$3/100000/POWER(1+Kalkulačka!$H$7,M1)","v":270.41144767674649},{"$f":"VLOOKUP(Kalkulačka!$C$5,Data!$F$1:$AD$135,15,FALSE)*Kalkulačka!$H$3/100000/POWER(1+Kalkulačka!$H$7,N1)","v":260.01100738148705},{"$f":"VLOOKUP(Kalkulačka!$C$5,Data!$F$1:$AD$135,15,FALSE)*Kalkulačka!$H$3/100000/POWER(1+Kalkulačka!$H$7,O1)","v":250.01058402066056},{"$f":"VLOOKUP(Kalkulačka!$C$5,Data!$F$1:$AD$135,15,FALSE)*Kalkulačka!$H$3/100000/POWER(1+Kalkulačka!$H$7,P1)","v":240.39479232755824},{"$f":"VLOOKUP(Kalkulačka!$C$5,Data!$F$1:$AD$135,15,FALSE)*Kalkulačka!$H$3/100000/POWER(1+Kalkulačka!$H$7,Q1)","v":231.14883877649831},{"$f":"VLOOKUP(Kalkulačka!$C$5,Data!$F$1:$AD$135,15,FALSE)*Kalkulačka!$H$3/100000/POWER(1+Kalkulačka!$H$7,R1)","v":222.25849882355607}]
{"$rows_left_out":123}
{"sheet":"Data","index":3,"n_rows":135,"n_cols":33,"rows_kept":135,"cut":false,"hidden":true,"merged":[]}
["Link","Typ","Trieda ","Výrobca","Model","Celý názov","Rok uvedenia","Status výroby","Cena s DPH","Dotácia","Hmotnosť","Celkový kombinovaný výkon(kW)","CO2 (g/km)","Objem motora","Kapacita batérie(kWh)","Dojazd (km)","Palivo","Spotreba (l/100km)","Spotreba kombinovaná (Wh/km)","Spotreba paliva na 100,000km (EUR)","Reg. Daň**","Daň z mot. Vozidiel***","Poplatky","Prevádzkové emisie na 100,000km (g CO2)","Emisie z výroby/km","Spolu E z výroby ","Celkové emisie v tonách","Celkové náklady","Údržba","Poistenie","Opravy na 10000 km jazdy ","Formát obrázka","jpg_nazov_auta"]
["https://webauto.sk/audi-a4-allroad-2-0-tdi-quattro-s-tronic/","Standard","Stredná trieda","Audi ","A4 Allroad 2.0 TDI Quattro STR",{"$f":"CONCATENATE(D2,\" \",E2)","v":"Audi  A4 Allroad 2.0 TDI Quattro STR"},2017,1,43700,{"$f":"IF(OR(B2=\"Elektromobil\",B2=\"Plug-in\"),Kalkulačka!$H$8,0)","v":0},2245,120,128,1968,0,{"$f":"58/R2*100","v":753.2467532467532},"nafta",7.7,0,{"$f":"R2*1000*Kalkulačka!$H$5","v":9555.7000000000007},{"$f":"MAX(IF(OR(B2=\"Hybrid\",B2=\"Plug-in\"),0.5*VLOOKUP(L2,Predpoklady!$A$10:$C$25,3,1),VLOOKUP(L2,Predpoklady!$A$10:$C$25,3,1)),33)","v":360},null,null,{"$f":"M2*100000","v":12800000},{"$f":"Predpoklady!$B$5","v":28},{"$f":"Predpoklady!$C$5","v":7000000},{"$f":"(X2+Z2)/1000000","v":19.8},{"$f":"I2+T2+U2","v":53615.7},{"$f":"IF(B2=\"Elektromobil\",Kalkulačka!$H$9,IF(B2=\"Standard\",Kalkulačka!$H$11,Kalkulačka!$H$10))*10","v":4800},180.54,{"$f":"AC2/10","v":480},".jpg",{"$f":"CONCATENATE(F2,AF2)","v":"Audi  A4 Allroad 2.0 TDI Quattro STR.jpg"}]
["https://www.auto-motor-und-sport.de/test/audi-a3-tfsi-a3-e-tron-vergleich-test/","Plug-in","Stredná trieda","Audi","A3 Sportback 1.4 TFSI e-tron Ambition","Audi A3 Sportback 1.4 TFSI e-tron Ambition",2014,0,39400,{"$f":"IF(OR(B3=\"Elektromobil\",B3=\"Plug-in\"),Kalkulačka!$H$8,0)","v":0},2050,150,35,1395,8.8000000000000007,{"$f":"0.6*O3/S3*1000+0.4*40/R3*100","v":986.30467571644044},"benzín + elektrina",1.7,117,{"$f":"R3*1000*Kalkulačka!$H$4*0.4+S3/1000*100000*Kalkulačka!$H$6*0.6","v":1947.835},{"$f":"MAX(IF(OR(B3=\"Hybrid\",B3=\"Plug-in\"),0.5*VLOOKUP(L3,Predpoklady!$A$10:$C$25,3,1),VLOOKUP(L3,Predpoklady!$A$10:$C$25,3,1)),33)","v":435},null,null,{"$f":"(0.6*Predpoklady!$B$1*S3/1000+0.4*M3)*100000","v":2705720},{"$f":"Predpoklady!$B$3","v":37},{"$f":"Predpoklady!$C$3","v":11000000},13.705719999999999,41782.834999999999,{"$f":"IF(B3=\"Elektromobil\",Kalkulačka!$H$9,IF(B3=\"Standard\",Kalkulačka!$H$11,Kalkulačka!$H$10))*10","v":4400},148.32,440,".jpg",{"$f":"CONCATENATE(F3,AF3)","v":"Audi A3 Sportback 1.4 TFSI e-tron Ambition.jpg"}]
["https://www.automobile-catalog.com/car/2017/2503520/audi_a6_2_0_tdi_190_quattro_s-tronic.html","Standard","Luxusné","Audi","A6 2.0 TDI Quattro","Audi A6 2.0 TDI Quattro",2017,0,57750,{"$f":"IF(OR(B4=\"Elektromobil\",B4=\"Plug-in\"),Kalkulačka!$H$8,0)","v":0},2240,140,128,1968,0,{"$f":"73/R4*100","v":848.83720930232562},"nafta",8.6,0,{"$f":"R4*1000*Kalkulačka!$H$5","v":10672.6},{"$f":"MAX(IF(OR(B4=\"Hybrid\",B4=\"Plug-in\"),0.5*VLOOKUP(L4,Predpoklady!$A$10:$C$25,3,1),VLOOKUP(L4,Predpoklady!$A$10:$C$25,3,1)),33)","v":700},{"$f":"148*8","v":1184},{"$f":"U4+V4","v":1884},{"$f":"M4*100000","v":12800000},{"$f":"Predpoklady!$B$5","v":28},{"$f":"Predpoklady!$C$4","v":8000000},20.8,69122.600000000006,{"$f":"IF(B4=\"Elektromobil\",Kalkulačka!$H$9,IF(B4=\"Standard\",Kalkulačka!$H$11,Kalkulačka!$H$10))*10","v":4800},170.73,480,".jpg",{"$f":"CONCATENATE(F4,AF4)","v":"Audi A6 2.0 TDI Quattro.jpg"}]
["https://www.audi.sk/e-tron/e-tron/cennik-a-katalog","Elektromobil","SUV","Audi","e-tron advanced 55 quattro","Audi e-tron advanced 55 quattro",2019,1,81400,{"$f":"IF(OR(B5=\"Elektromobil\",B5=\"Plug-in\"),Kalkulačka!$H$8,0)","v":0},2565,265,0,0,95,{"$f":"O5/S5*1000","v":413.04347826086956},"elektrina",0,230,{"$f":"S5*100000*0.001*Kalkulačka!$H$6","v":3409.75},{"$f":"Predpoklady!$B$27","v":33},null,null,{"$f":"S5*100000*0.001*Predpoklady!$B$1","v":4278000},{"$f":"Predpoklady!$B$2","v":42},{"$f":"Predpoklady!$C$2","v":10500000},14.778,84842.75,{"$f":"IF(B5=\"Elektromobil\",Kalkulačka!$H$9,IF(B5=\"Standard\",Kalkulačka!$H$11,Kalkulačka!$H$10))*10","v":2900},279.99,290]
["https://www.ultimatespecs.com/car-specs/Audi/106213/Audi-Q7-II-30-TDI-e-tron-Quattro-Design-5-seats.html","Plug-in","SUV","Audi","Q7 3.0 TDI e-tron Quattro","Audi Q7 3.0 TDI e-tron Quattro",2016,0,84000,{"$f":"IF(OR(B6=\"Elektromobil\",B6=\"Plug-in\"),Kalkulačka!$H$8,0)","v":0},3185,192.39,46,2967,17.3,{"$f":"0.6*O6/S6*1000+0.4*40/R6*100","v":997.28457869634349},"nafta + elektrina",1.7,185,{"$f":"R6*1000*Kalkulačka!$H$5*0.4+S6/1000*100000*Kalkulačka!$H$6*0.6","v":2489.4549999999999},{"$f":"MAX(IF(OR(B6=\"Hybrid\",B6=\"Plug-in\"),0.5*VLOOKUP(L6,Predpoklady!$A$10:$C$25,3,1),VLOOKUP(L6,Predpoklady!$A$10:$C$25,3,1)),33)","v":950},null,null,{"$f":"(0.6*Predpoklady!$B$1*S6/1000+0.4*M6)*100000","v":3904600.0000000005},{"$f":"Predpoklady!$B$3","v":37},{"$f":"Predpoklady!$C$3","v":11000000},14.9046,87439.455000000002,{"$f":"IF(B6=\"Elektromobil\",Kalkulačka!$H$9,IF(B6=\"Standard\",Kalkulačka!$H$11,Kalkulačka!$H$10))*10","v":4400},190.03,440,".jpg",{"$f":"CONCATENATE(F6,AF6)","v":"Audi Q7 3.0 TDI e-tron Quattro.jpg"}]
["https://www.auto-data.net/en/audi-q7-typ-4m-e-tron-3.0-tdi-374hp-quattro-s-tronic-23166","Standard","SUV","Audi","Q7 50 TDI Quattro","Audi Q7 50 TDI Quattro",2018,1,65400,{"$f":"IF(OR(B7=\"Elektromobil\",B7=\"Plug-in\"),Kalkulačka!$H$8,0)","v":0},2990,210,178,2967,0,{"$f":"85/R7*100","v":664.0625},"nafta",12.8,0,{"$f":"R7*1000*Kalkulačka!$H$5","v":15884.800000000001},{"$f":"MAX(IF(OR(B7=\"Hybrid\",B7=\"Plug-in\"),0.5*VLOOKUP(L7,Predpoklady!$A$10:$C$25,3,1),VLOOKUP(L7,Predpoklady!$A$10:$C$25,3,1)),33)","v":2300},null,null,{"$f":"M7*100000","v":17800000},{"$f":"Predpoklady!$B$5","v":28},{"$f":"Predpoklady!$C$5","v":7000000},24.8,83584.800000000003,{"$f":"IF(B7=\"Elektromobil\",Kalkulačka!$H$9,IF(B7=\"Standard\",Kalkulačka!$H$11,Kalkulačka!$H$10))*10","v":4800},361.92,480,".jpg","Audi Q7 50 TDI Quattro.jpg"]
["https://www.cars-data.com/en/audi-tt-coupe-1.8-tfsi-specs/69685/tech","Standard","Luxusné","Audi","TT Coupe 1.8 TFSI","Audi TT Coupe 1.8 TFSI",2015,0,25000,{"$f":"IF(OR(B8=\"Elektromobil\",B8=\"Plug-in\"),Kalkulačka!$H$8,0)","v":0},1610,132,134,1798,0,{"$f":"50/R8*100","v":675.67567567567562},"benzín",7.4,0,{"$f":"R8*1000*Kalkulačka!$H$4","v":9871.6},{"$f":"MAX(IF(OR(B8=\"Hybrid\",B8=\"Plug-in\"),0.5*VLOOKUP(L8,Predpoklady!$A$10:$C$25,3,1),VLOOKUP(L8,Predpoklady!$A$10:$C$25,3,1)),33)","v":530},null,null,{"$f":"M8*100000","v":13400000},{"$f":"Predpoklady!$B$4","v":32},{"$f":"Predpoklady!$C$4","v":8000000},21.4,35401.599999999999,{"$f":"IF(B8=\"Elektromobil\",Kalkulačka!$H$9,IF(B8=\"Standard\",Kalkulačka!$H$11,Kalkulačka!$H$10))*10","v":4800},235.14,480,".jpg","Audi TT Coupe 1.8 TFSI.jpg"]
{"$rows_left_out":128}
{"sheet":"Predpoklady","index":4,"n_rows":40,"n_cols":6,"rows_kept":40,"cut":false,"hidden":true,"merged":[]}
["Emisie na výrobu 1 kWh elektriny",186,"g CO2"]
["Emisie z výroby elektroauta (g/km)",{"$f":"70*150000/250000","v":42},{"$f":"70*150000","v":10500000},"Shades of Green"]
["Emisie z výroby hybridu (g/km)",{"$f":"(B2+B4)/2","v":37},{"$f":"(70+40)/2*200000","v":11000000}]
["Emisie z výroby - benzín (g/km)",{"$f":"40*200000/250000","v":32},{"$f":"40*200000","v":8000000}]
["Emisie z výroby - nafta (g(km)",{"$f":"35*200000/250000","v":28},{"$f":"35*200000","v":7000000}]
[]
["Registračná daň"]
["Výkon motora v kW",null,"Sadzba poplatku ",null,"Vek vozidla od dňa prvej evidencie (vrátane tohto dňa)","Koeficient zostatkovej hodnoty vozidla"]
{"$rows_left_out":33}
{"sheet":"Emisie","index":5,"n_rows":153,"n_cols":27,"rows_kept":153,"cut":false,"hidden":true,"merged":[[15,1,15,3],[15,4,15,6],[0,1,0,13],[0,14,0,26],[5,1,5,3],[5,4,5,6],[10,1,10,3],[10,4,10,6]]}
[null,"100 000 km",null,null,null,null,null,null,null,null,null,null,null,null,"200 000 km "]
[null,{"$f":"Kalkulačka!C5","v":"Mercedes B 250e"},{"$f":"Kalkulačka!D5","v":"Mercedes B 250"},"Kompakt - elektromobil","Kompakt - hybrid","Kompakt - štandard","Luxusná trieda - elektromobil","Luxusná trieda - hybrid","Luxusná trieda - štandard","Mini - elektromobil","Van - Elektromobil","Stredná trieda - elektromobil","Stredná trieda - hybrid","Stredná trieda - štandard",{"$f":"Kalkulačka!C5","v":"Mercedes B 250e"},{"$f":"Kalkulačka!D5","v":"Mercedes B 250"},"Kompakt - elektromobil","Kompakt - hybrid","Kompakt - štandard","Luxusná trieda - elektromobil","Luxusná trieda - hybrid","Luxusná trieda - štandard","Mini - elektromobil","Van - Elektromobil","Stredná trieda - elektromobil","Stredná trieda - hybrid","Stredná trieda - štandard"]
["Prevádzka",{"$f":"VLOOKUP($B$2,Data!$F$2:$X$135,19,FALSE)/1000000","v":3.3479999999999999},{"$f":"VLOOKUP($C$2,Data!$F$2:$X$135,19,FALSE)/1000000","v":15.6},{"$f":"HLOOKUP(D$2,'Pomocné tabuľky'!$B$55:$N$63,9,FALSE)","v":3.0581385565821524},{"$f":"HLOOKUP(E$2,'Pomocné tabuľky'!$B$55:$N$63,9,FALSE)","v":6.0219066666666672},{"$f":"HLOOKUP(F$2,'Pomocné tabuľky'!$B$55:$N$63,9,FALSE)","v":12.13076923076923},{"$f":"HLOOKUP(G$2,'Pomocné tabuľky'!$B$55:$N$63,9,FALSE)","v":3.5712000000000002},{"$f":"HLOOKUP(H$2,'Pomocné tabuľky'!$B$55:$N$63,9,FALSE)","v":3.7883345454545454},{"$f":"HLOOKUP(I$2,'Pomocné tabuľky'!$B$55:$N$63,9,FALSE)","v":15.175000000000001},{"$f":"HLOOKUP(J$2,'Pomocné tabuľky'!$B$55:$N$63,9,FALSE)","v":2.3237988002594028},{"$f":"HLOOKUP(K$2,'Pomocné tabuľky'!$B$55:$N$63,9,FALSE)","v":2.9573999999999998},{"$f":"HLOOKUP(L$2,'Pomocné tabuľky'!$B$55:$N$63,9,FALSE)","v":2.7404000000000002},{"$f":"HLOOKUP(M$2,'Pomocné tabuľky'!$B$55:$N$63,9,FALSE)","v":4.1957771428571426},{"$f":"HLOOKUP(N$2,'Pomocné tabuľky'!$B$55:$N$63,9,FALSE)","v":13.616},{"$f":"B3:N3*2","v":6.6959999999999997},31.2,6.1162771131643048,12.043813333333334,24.261538461538461,7.1424000000000003,7.5766690909090908,30.35,4.6475976005188055,5.9147999999999996,5.4808000000000003,8.3915542857142853,27.231999999999999]
["Výroba",{"$f":"VLOOKUP($B$2,Data!$F$2:$Z$135,21,FALSE)/1000000","v":10.5},{"$f":"VLOOKUP($C$2,Data!$F$2:$Z$135,21,FALSE)/1000000","v":8},{"$f":"HLOOKUP(D$2,'Pomocné tabuľky'!$B$55:$N$63,8,FALSE)","v":10.25},{"$f":"HLOOKUP(E$2,'Pomocné tabuľky'!$B$55:$N$63,8,FALSE)","v":11},{"$f":"HLOOKUP(F$2,'Pomocné tabuľky'!$B$55:$N$63,8,FALSE)","v":7.9230769230769234},{"$f":"HLOOKUP(G$2,'Pomocné tabuľky'!$B$55:$N$63,8,FALSE)","v":10.5},{"$f":"HLOOKUP(H$2,'Pomocné tabuľky'!$B$55:$N$63,8,FALSE)","v":11},{"$f":"HLOOKUP(I$2,'Pomocné tabuľky'!$B$55:$N$63,8,FALSE)","v":7.75},{"$f":"HLOOKUP(J$2,'Pomocné tabuľky'!$B$55:$N$63,8,FALSE)","v":10.5},{"$f":"HLOOKUP(K$2,'Pomocné tabuľky'!$B$55:$N$63,8,FALSE)","v":10.5},{"$f":"HLOOKUP(L$2,'Pomocné tabuľky'!$B$55:$N$63,8,FALSE)","v":10.5},{"$f":"HLOOKUP(M$2,'Pomocné tabuľky'!$B$55:$N$63,8,FALSE)","v":11},{"$f":"HLOOKUP(N$2,'Pomocné tabuľky'!$B$55:$N$63,8,FALSE)","v":7.88},{"$f":"B4","v":10.5},{"$f":"C4","v":8},10.25,11,7.9230769230769234,10.5,11,7.75,10.5,10.5,10.5,11,7.88]
[]
[null,"100 000 km",null,null,"200 000 km "]
[null,"Kompakt - elektromobil","Kompakt - hybrid","Kompakt - štandard","Kompakt - elektromobil","Kompakt - hybrid","Kompakt - štandard"]
["Prevádzka",{"$f":"HLOOKUP(B7,$D$2:$S$3,2,FALSE)","v":3.0581385565821524},{"$f":"HLOOKUP(C7,$D$2:$S$3,2,FALSE)","v":6.0219066666666672},{"$f":"HLOOKUP(D7,$D$2:$S$3,2,FALSE)","v":12.13076923076923},{"$f":"HLOOKUP(E7,$D$2:$S$3,2,FALSE)*2","v":6.1162771131643048},{"$f":"HLOOKUP(F7,$D$2:$S$3,2,FALSE)*2","v":12.043813333333334},24.261538461538461]
{"$rows_left_out":146}
{"sheet":"Grafy","index":6,"n_rows":131,"n_cols":22,"rows_kept":131,"cut":false,"hidden":true,"merged":[[109,20,109,21],[110,0,115,0],[117,0,122,0],[110,18,115,18],[117,18,122,18],[110,19,115,19],[117,19,122,19]]}
[]
[]
[]
[]
[]
[]
[]
[]
{"$rows_left_out":124}
{"sheet":"Pomocné tabuľky","index":7,"n_rows":65,"n_cols":17,"rows_kept":65,"cut":false,"hidden":true,"merged":[]}
[0]
[0.01]
[0.02]
[0.03]
[0.04]
[0.05]
["Triedy","Mini",null,"Pohon","Elektromobily"]
[null,"Kompakt",null,null,"Hybridy a Plug-iny"]
{"$rows_left_out":58}
{"sheet":"Hárok1","index":8,"n_rows":49,"n_cols":39,"rows_kept":49,"cut":false,"hidden":true,"merged":[[0,0,0,6],[33,9,35,9],[33,10,35,10],[28,0,28,1],[1,7,2,7],[29,0,29,1],[30,0,30,1],[31,0,31,1],[32,0,32,1],[33,0,35,0],[34,2,35,2],[34,3,35,3],[34,4,35,4],[34,6,35,6],[3,0,5,0],[7,0,9,0],[45,23,45,30],[2,5,2,6],[1,5,1,6],[2,0,2,1],[1,0,1,1],[34,8,35,8],[32,23,32,32]]}
["Porovnanie typov pohonov podľa nákladov na údržbu a opravy"]
["Štúdia",null,"How Expensive Are Electric Vehicles? A Total Cost of Ownership (2013)","Low Carbon Cars in the 2020s: Consumer Impacts and EU Policy Implications (2016)","Battery Electric Vehicles vs. Internal Combustion Vehicles (2016)","Cost Analysis of Plug-in Hybrid Electric Vehicles Including Maintenance & Repair Costs and Resale Values (2012)",null,"Priemerné ukazovatele",null,null,null,null,null,null,null,null,null,null,null,null,null,"zdroj: ","http://www.element-energy.co.uk/wordpress/wp-content/uploads/2017/01/20161122_Low-carbon-cars-in-the-2020s---Consumer-impacts-and-EU-policy-implications---FINAL-REPORT.pdf","prepočty iep"]
[null,null,"N / A","EU","USA","USA, EU a Japonsko"]
[null,"Klasický spaľovací pohon",1,1,1,1,1,null,null,null,null,null,null,null,null,null,null,null,null,null,null,null,null,0,1,2,3,4,5,6,7,8,9,10,11,12,13,14,15]
[null,"Hybrid a plug-in hybrid",1,0.7,1,{"$f":"7.1/7.3","v":0.9726027397260274},1,{"$f":"AVERAGE(C5:G5)","v":0.93452054794520545},null,null,null,null,null,null,null,null,null,null,null,null,null,null,"Spaľovací pohon",1,{"$f":"Y7*(1+AE41)","v":0.78018819195394362},{"$f":"Y5*Z7/Y7","v":0.63833579341686297},{"$f":"Z5*AA7/Z7","v":0.52012546130262904},0.44919926203408872,0.40191512918839517,0.36645202955412498,0.31916789670843149,0.29552583028558471,0.26006273065131452,0.23642066422846775,0.21277859780562097,0.18913653138277423,0.17731549817135084,0.15367343174850406,0.14185239853708065]
[null,"Elektromobil",0.65,0.5,0.4,{"$f":"5.9/7.3","v":0.8082191780821919},{"$f":"435/609","v":0.7142857142857143},{"$f":"AVERAGE(C6:G6)","v":0.61450097847358121},null,null,null,null,null,null,null,null,null,null,null,null,null,null,"Spaľovací pohon povýšený o základnú dotáciu",1,{"$f":"Y7*(1+AE40)","v":0.74584870853853125},{"$f":"Y6*Z7/Y7","v":0.61023985244061651},{"$f":"Z6*AA7/Z7","v":0.49723247235902079},{"$f":"AA6*AB7/AA7","v":0.42942804431006337},0.38422509227742513,0.35032287825294639,0.3051199262203082,0.28251845020398908,0.2486162361795104,0.22601476016319128,0.20341328414687213,0.180811808130553,0.16951107012239341,0.14690959410607429,0.1356088560979147]
[null,null,null,null,null,null,null,null,null,null,null,null,null,null,null,null,null,null,null,null,null,null,"Spaľovací pohon",1,{"$f":"0.66","v":0.66},0.54,0.44,0.38,0.34,0.31,0.27,0.25,0.22,0.2,0.18,0.16,0.15,0.13,0.12]
[null,"Klasický spaľovací pohon",null,null,{"$f":"5500/20*0.88","v":242},{"$f":"0.073*10000","v":730},{"$f":"609","v":609},{"$f":"ROUNDDOWN(AVERAGE(E8:F8),-1)","v":480},null,null,null,null,null,null,null,null,null,null,null,null,null,null,"Elektrický pohon s dotáciou 1000 eur",1,{"$f":"Y7*(1-AE38)","v":0.64283025829229379},{"$f":"Y8*Z7/Y7","v":0.5259520295118767},{"$f":"Z8*AA7/Z7","v":0.42855350552819582},0.37011439113798733,0.331154981544515,0.30193542434941073,0.2629760147559384,0.24349630995920221,0.21427675276409794,0.19479704796736177,0.17531734317062558,0.15583763837388942,0.14609778597552131,0.12661808117878515,0.11687822878041705]
{"$rows_left_out":42}
{"sheet":"Hárok2","index":9,"n_rows":21,"n_cols":6,"rows_kept":21,"cut":false,"hidden":true,"merged":[[12,4,12,5],[9,0,9,6],[5,0,6,0],[5,1,6,1],[0,0,0,4],[10,3,10,5],[10,1,11,1],[10,2,11,2],[20,3,20,5],[13,4,13,5],[14,4,14,5],[16,4,16,5],[18,4,18,5],[19,3,19,5]]}
["Porovnanie typov pohonov podľa nákladov na údržbu a opravy"]
[null,"Špecifické trhy","Klasický spaľovací pohon","Hybrid a plug-in hybrid","Elektromobil"]
["Kenneth Lebeau et al. (2013)","N /A",1,1,0.65]
["Stewart, A. - Dodson, T. (2016)","EU",1,0.7,0.5]
["Arthur D. Little (2016)","USA",1,1,0.4]
["Bernd Propfe et al. (2012)","EU, USA, Japonsko",1,{"$f":"7.1/7.3","v":0.9726027397260274},{"$f":"5.9/7.3","v":0.8082191780821919}]
[null,null,1,1,{"$f":"435/609","v":0.7142857142857143}]
["Priemer",null,null,{"$f":"AVERAGE(D3:D7)","v":0.93452054794520545},{"$f":"AVERAGE(E3:E7)","v":0.61450097847358121}]
{"$rows_left_out":13}