{"text_format":"1","workbook":"xlsx","n_sheets":5,"sheets":["Kalkulačka","Podklady","Formy","Porovnanie alternatív","zam"],"not_rendered":{"charts":1,"images":0,"macros":1,"external_links":0,"defined_names":0,"comments":0,"pivot_tables":0},"unopened":[],"bounds":{"document_bytes":16777216,"sheet_cells":100000,"rows_first":2000,"rows_last":500,"rows_between":2000,"halvings":0,"cell_chars":16384,"cell_head_chars":4096},"cells_cut":0,"cells_raw":0,"read":"whole","date_system":"1900"}

{"sheet":"Kalkulačka","index":0,"n_rows":49,"n_cols":24,"rows_kept":49,"cut":false,"hidden":false,"merged":[[22,23,23,23],[22,18,23,18],[22,19,23,19],[22,20,23,20],[22,21,23,21],[22,22,23,22],[37,3,37,4],[21,6,23,6],[21,7,23,7],[21,8,21,10],[35,1,35,12],[36,2,38,2],[36,3,36,7],[36,8,36,12],[37,5,37,6],[37,7,38,7],[37,8,37,9],[37,10,37,11],[37,12,38,12],[36,1,38,1],[22,2,23,2],[22,3,23,3],[22,4,23,4],[21,4,21,5],[22,5,23,5],[19,1,19,13],[19,14,19,23],[20,2,20,10],[20,11,20,13],[21,2,21,3],[20,18,20,23],[21,18,21,20],[21,21,21,23],[20,15,20,16],[21,15,23,15],[21,16,23,16],[21,17,23,17],[22,8,23,8],[10,12,10,13],[11,12,11,13],[18,1,18,23],[5,2,5,3],[6,2,6,3],[7,2,7,3],[9,2,9,3],[3,2,3,3],[4,2,4,3],[12,12,12,13],[8,2,8,3],[10,1,10,3],[3,1,9,1],[2,14,2,15],[8,12,8,13],[20,1,23,1],[1,9,1,13],[1,14,1,20],[3,14,3,15],[4,14,4,15],[6,14,6,15],[5,12,5,13],[6,12,6,13],[7,12,7,13],[1,1,1,8],[2,1,2,4],[2,5,2,8],[9,12,9,13],[20,14,23,14],[22,9,23,9],[22,10,23,10],[21,11,21,13],[22,11,23,11],[22,12,23,12],[22,13,23,13]]}
[]
[null,"Výsledky",null,null,null,null,null,null,null,"Vstupy",null,null,null,null,"Konštanty"]
[null,"Sumy",null,null,null,"Porovnanie možností",null,null,null,"Rozloha A zón",null,null,null,null,null,null,"Lesy SR","ŠL TANAP","LPM Ulič","Neštátni","Štátni/Všetci"]
[null,"Nájmy","Nájmy",null,{"$f":"C34+D34","v":1265468.3097457041},null,"Nájmy","Výkupy","Zámeny","Rozloha národných parkov",null,null,null,null,"Strata štátneho rozpočtu (ha)",null,27.5,38.5,17.3,21.6]
[null,null,"Zmluvná starostlivosť",null,{"$f":"L34+M34","v":1574740.165257975},"0 rokov",{"$f":"'Porovnanie alternatív'!B2","v":3294641.5386109203},{"$f":"'Porovnanie alternatív'!C2","v":74469493.968081236},{"$f":"'Porovnanie alternatív'!D2","v":2387266.8285907861},"Preferencia neštátny vs. štátny vlastník",null,null,null,null,"Strata obcí (ha)",null,null,null,null,2.2999999999999998,7.3]
[null,null,"Dopad na štátny rozpočet",null,{"$f":"E34+F34","v":-1.1868053206853803E-10},"25 rokov",{"$f":"'Porovnanie alternatív'!B27","v":43324382.341323279},{"$f":"'Porovnanie alternatív'!C27","v":96663794.56315127},{"$f":"'Porovnanie alternatív'!D27","v":29628518.767648447},"Nájmy lesných pozemkov",null,null,1,null,"Dopad na štátne podniky"]
[null,null,"Dopad na obce",null,{"$f":"G34","v":-1.7205792346430826E-11},"50 rokov",{"$f":"'Porovnanie alternatív'!B52","v":55145275.750707231},{"$f":"'Porovnanie alternatív'!C52","v":103217833.04476875},{"$f":"'Porovnanie alternatív'!D52","v":37672935.969769217},"Výkupy lesných pozemkov",null,null,1,null,"Strata zisku štátnych podnikov (ha)",null,{"$f":"VLOOKUP(Formy!$B$48,Formy!$D$49:$G$50,2,0)","v":17.600000000000001},{"$f":"VLOOKUP(Formy!$B$48,Formy!$D$49:$G$50,3,0)","v":3.7},{"$f":"VLOOKUP(Formy!$B$48,Formy!$D$49:$G$50,4,0)","v":37.299999999999997}]
[null,null,"Dopad na štátne organizácie",null,{"$f":"H34","v":-6.6251004682271748E-12},"75 rokov",{"$f":"'Porovnanie alternatív'!B77","v":58636018.33844211},{"$f":"'Porovnanie alternatív'!C77","v":105153258.77420419},{"$f":"'Porovnanie alternatív'!D77","v":40048474.666248649},"Nájmy pre poľovné združenia (eur / ha / rok)",null,null,2.5,null,"Inštitucionálne zmeny (ha)",null,null,null,null,null,6]
[null,null,"Dopad na zamestnanosť",null,{"$f":"zam!I5","v":0},"100 rokov",{"$f":"'Porovnanie alternatív'!B102","v":59666844.299883649},{"$f":"'Porovnanie alternatív'!C102","v":105724795.35652165},{"$f":"'Porovnanie alternatív'!D102","v":40749977.827594332},"Nájmy nelesných pozemkov (eur / ha / rok)",null,null,35,null,"Diskontná miera",null,0.05]
[null,null,"TOTAL",null,{"$f":"SUM(E4:E9)","v":2840208.4750036793},null,null,null,null,"Výkupy nelesných pozemkov (eur / ha)",null,null,1500]
[null,"Jednorazové poplatky",null,null,{"$f":"(F49+G49+K49+L49)*$M$12+H49*$M$13","v":454433.06360724097},null,null,null,null,"Zmluvná starostlivosť (eur / ha / rok)",null,null,40]
[null,null,null,null,null,null,null,null,null,"Jednorazové poplatky (eur / ha)",null,null,10]
[null,null,null,null,null,null,null,null,null,"Označovacie práce v teréne (eur / ha)",null,null,0.2]
[null,null,null,null,null,null,null,null,null,"Veľkosť nárazníkovej zóny (m)"]
[]
[]
[]
[]
[null,"Výsledky po jednotlivých národných parkoch"]
[null,"Výstupy",null,null,null,null,null,null,null,null,null,null,null,null,"Vstupy"]
{"$rows_left_out":30}
{"sheet":"Podklady","index":1,"n_rows":56,"n_cols":38,"rows_kept":56,"cut":false,"hidden":false,"merged":[[45,30,45,33],[45,34,45,35],[45,36,45,37],[43,0,43,37],[44,0,46,0],[44,1,46,1],[44,2,45,2],[44,3,44,9],[44,10,44,17],[44,18,44,25],[44,26,44,33],[44,34,44,37],[45,4,45,6],[45,7,45,9],[45,11,45,13],[45,14,45,17],[45,19,45,21],[45,22,45,25],[45,27,45,29],[16,34,16,37],[15,0,15,37],[30,0,32,0],[30,1,32,1],[30,3,30,9],[31,4,31,6],[31,7,31,9],[17,34,17,35],[31,34,31,35],[31,36,31,37],[17,36,17,37],[30,34,30,37],[29,0,29,37],[31,19,31,21],[31,22,31,25],[31,30,31,33],[31,27,31,29],[30,2,31,2],[30,10,30,17],[30,18,30,25],[30,26,30,33],[31,11,31,13],[31,14,31,17],[17,30,17,33],[3,22,3,23],[3,30,3,31],[3,14,3,15],[16,2,17,2],[1,2,4,2],[2,10,3,10],[2,18,3,18],[2,26,3,26],[17,11,17,13],[17,14,17,17],[16,3,16,9],[16,10,16,17],[16,18,16,25],[16,26,16,33],[0,0,0,33],[1,0,4,0],[1,1,4,1],[2,22,2,25],[2,30,2,33],[1,3,1,9],[1,10,1,17],[1,18,1,25],[1,26,1,33],[2,11,2,13],[2,19,2,21],[2,27,2,29],[2,14,2,17],[2,4,2,6],[2,7,2,9],[2,3,3,3],[16,0,18,0],[16,1,18,1],[17,19,17,21],[17,22,17,25],[17,27,17,29],[17,4,17,6],[17,7,17,9]]}
["Terajší stav národných parkov"]
["NP","Rozloha parku","Pomer 5. stupeň / NP","5. stupeň",null,null,null,null,null,null,"4. stupeň",null,null,null,null,null,null,null,"3. stupeň",null,null,null,null,null,null,null,"2. stupeň"]
[null,null,null,"Celkovo","Štátne",null,null,"Neštátne",null,null,"Celkovo","Štátne",null,null,"Neštátne",null,null,null,"Celkovo","Štátne",null,null,"Neštátne",null,null,null,"Celkovo","Štátne",null,null,"Neštátne"]
[null,null,null,null,"Celkovo",null,null,null,null,null,null,"Celkovo",null,null,"Celkovo",null,"Lesné","Nelesné",null,"Celkovo",null,null,"Celkovo",null,"Lesné","Nelesné",null,"Celkovo",null,null,"Celkovo",null,"Lesné","Nelesné"]
[null,null,null,"rozloha","rozloha","Lesné","Nelesné","Celkovo","Lesné","Nelesné","rozloha","rozloha","Lesné","Nelesné","rozloha","koef","rozloha","rozloha",null,"rozloha","Lesné","Nelesné","rozloha","koef","rozloha","rozloha",null,"rozloha","Lesné","Nelesné","rozloha","koef","rozloha","rozloha"]
["Veľká Fatra",41065.249718356048,{"$f":"D6/B6","v":0.15041645629542461},6176.8893395218001,{"$f":"F6+G6","v":4550.7144050904999},4406.2249313418997,144.48947374860001,{"$f":"I6+J6","v":1626.1749344313},1581.8000012984,44.374933132900004,192.83354715499999,{"$f":"M6+N6","v":58.437370072299998},32.700440983299998,25.736929089,{"$f":"Q6+R6","v":134.39617708270001},{"$f":"O6/K6","v":0.6969543373833812},125.25164279410001,9.1445342885999992,34694.167749380198,{"$f":"U6+V6","v":21044.061832781499},18588.869081282999,2455.1927514985,{"$f":"Y6+Z6","v":13650.105916598701},{"$f":"W6/S6","v":0.39344093840794198},10571.1447868714,3078.9611297273,1.359082299,{"$f":"AC6+AD6","v":0.22561198499999999},6.3089000000000005E-4,0.22498109499999999,{"$f":"AG6+AH6","v":1.133470314},{"$f":"AE6/AA6","v":0.83399681890787392},0.23622516700000001,0.89724514700000002]
["Nízke Tatry",76759.212081858394,0.1532377126654545,11762.406085426499,{"$f":"F7+G7","v":3273.4246176858996},2297.3613352145999,976.06328247129989,{"$f":"I7+J7","v":8488.9814677405993},7548.3519879768,940.62947976380008,464.14229860820006,104.46121214919999,84.591458963999997,19.869753185199997,359.68108645900003,0.77493709911283115,299.79626354070001,59.884822918300003,64532.255135128697,{"$f":"U7+V7","v":43174.0240069094},39055.512399570296,4118.5116073391,21358.231128219297,{"$f":"W7/S7","v":0.33096985505148968},17248.933863396298,4109.2972648229998,0.40856269500000003,{"$f":"AC7+AD7","v":0.37072748570000003},0.16822059480000001,0.20250689090000001,3.7835209299999999E-2,{"$f":"AE7/AA7","v":9.260563865234929E-2},2.81903682E-2,9.6448410999999991E-3]
["PIENAP",3712.380898619791,7.4527363634713073E-2,276.67396118200003,227.55413218489997,227.09602611819997,0.45810606669999998,49.119828997100001,44.425888545799999,4.6939404513000005,838.7070849081,145.1731963073,107.93003490209999,37.243161405200006,693.53388860079997,0.82690834628730103,544.1283160104,149.4055725904,1357.2969042875,39.856950543699995,4.6986410511000001,35.158309492599997,1317.4399537438001,0.97063505382072435,435.84461069320002,881.59534305060004,1239.7029482421999,16.879466103100004,6.3124187299999995E-2,16.816341915800002,1222.8234821391,0.98638426557988457,0.22174909580000002,1222.6017330432999]
["TANAP",73887.830419125094,0.42259542849206089,31224.659356318902,23119.625558178799,14648.3788161706,8471.2467420082012,8105.0337981400999,5929.7217214133998,2175.3120767267001,8730.9192240349003,4717.0918657431002,4473.2596878582999,243.83217788479999,4013.8273582918,0.45972563200932387,3933.3112553884998,80.516102903299995,33788.268518613302,13151.955490319502,11877.410107547701,1274.5453827718002,20636.3130282938,0.61075378920129197,15556.9830126589,5079.3300156349005,143.983320158,120.43633412150001,109.4799597275,10.956374394000001,23.546986036500002,0.16353967953135637,19.3399916543,4.2069943822000004]
["Malá Fatra",21424.708410159506,0.19519192136870092,4181.9299993431996,798.57035997530011,769.94914370060008,28.6212162747,3383.3596393678995,2902.2773696208997,481.082269747,18.254953818999997,11.541831434799999,9.7887277933999997,1.7531036413999999,6.7131223841999992,0.36774250161141975,5.6840974071999995,1.029024977,17224.522467208601,2629.4354566155998,2507.1514500808998,122.2840065347,14595.087010592999,0.8473434917210958,11990.8595639982,2604.2274465947999,9.8978870000000015E-4,1.822E-7,4.5900000000000001E-8,1.363E-7,9.8960650000000003E-4,0.99981592030703104,0,9.8960650000000003E-4]
["Poloniny",30755.577720423105,6.1132977295850786E-2,1880.1800345034001,1258.9615978753,1227.9659169324,30.995680942900002,621.21843662809999,580.52537088810004,40.693065740000002,54.7375524439,5.1982683955999995,2.8175432032000001,2.3807251923999999,49.539284048299997,0.90503286750119749,5.9810581892000005,43.558225859099998,28820.658583687898,13281.617257534301,12353.608315306101,928.00894222819988,15539.041326153598,{"$f":"W11/S11","v":0.53916329777933958},12479.948356642599,3059.0929695109999,1.5497878999999998E-3,1.0000000000000001E-18,1.0000000000000001E-18,0,1.5497878999999998E-3,1,0,1.5497878999999998E-3]
["Muránska planina",20199.071673440005,0.12340393187857278,2492.6448647995994,2258.7074921117996,2246.2432102747998,12.464281837,233.93737268779998,226.52322235039998,7.4141503374000006,345.30195228599996,338.28483205039998,320.36383574199999,17.920996308399999,7.0171202356000002,2.0321692910059183E-2,0.77923685720000002,6.2378833784000003,17357.821246886499,13233.056763135,12313.561689643,919.49507349200007,4124.7644837514999,0.23763146451870312,2133.2821148180997,1991.4823689334,3.3036094679000003,3.2695747409,8.2091994599999996E-2,3.1874827463000002,{"$f":"AG12+AH12","v":3.4034727000000001E-2},1.030228522187727E-2,0,3.4034727000000001E-2]
["Slovenský kras",34366.526738581888,3.5035913787433988E-2,1204.0626679864999,664.52928611769994,487.32286899209998,177.20641712559998,539.53338186880001,532.911660267,6.6217216018000009,962.91264743700003,571.0273239677,529.44431694479999,41.583007022899999,391.88532346930003,0.40697910086900141,315.2117325566,76.673590912700007,32133.608586981503,8017.8006635170004,7076.2244559005003,941.57620761650003,24115.807923464501,0.75048551917803263,17679.3821108829,6436.4258125816004,65.942836176900002,6.1302055399999993E-2,6.3845734999999999E-3,5.4917481899999995E-2,65.881534121499996,0.99907037581405267,47.3032987538,18.5782353677]
["Slovenský raj",19412.088,0.24118948563457468,4681.9915198130993,2524.3652530079999,2463.0710596348999,61.294193373100008,2157.6262668050999,2150.4551157310998,7.171151074,514.74,333.77027877489996,332.72564824199998,1.0446305329000001,180.97175204070001,0.35157895644538995,178.7920931008,2.1796589398999999,14135.348,8252.0945956364994,7699.5139137992992,552.58068183720002,5882.8686505933001,0.41618138093192331,4486.9507658891998,1395.9178847041001,79.679000000000002,8.6689831173999998,0.76890091940000005,7.9000821979999998,71.002894536900001,0.89111176767906219,5.1212099800000001E-2,70.951682437100004]
[null,null,null,{"$f":"SUM(D6:D14)","v":63881.437828895003},{"$f":"SUM(E6:E14)","v":38676.452702228198},{"$f":"SUM(F6:F14)","v":28773.613308380103},null,{"$f":"SUM(H6:H14)","v":25204.985126666797},{"$f":"SUM(I6:I14)","v":21496.992338091899}]
["Budúca A Zóna"]
["NP","Rozloha parku","A zóna","5. stupeň",null,null,null,null,null,null,"4. stupeň",null,null,null,null,null,null,null,"3. stupeň",null,null,null,null,null,null,null,"2. stupeň",null,null,null,null,null,null,null,"Dokopy"]
[null,null,null,"Celkovo","Štátne",null,null,"Neštátne",null,null,"Celkovo","Štátne",null,null,"Neštátne",null,null,null,"Celkovo","Štátne",null,null,"Neštátne",null,null,null,"Celkovo","Štátne",null,null,"Neštátne",null,null,null,"Štátne",null,"Neštátne"]
[null,null,"rozloha","rozloha","Celkovo","Lesné","Nelesné","Celkovo","Lesné","Nelesné","rozloha","Celkovo","Lesné","Nelesné","Celkovo",null,"Lesné","Nelesné","rozloha","Celkovo","Lesné","Nelesné","Celkovo",null,"Lesné","Nelesné","rozloha","Celkovo","Lesné","Nelesné","Celkovo",null,"Lesné","Nelesné","Lesné","Nelesné","Lesné","Nelesné"]
["Veľká Fatra",{"$f":"B6*Kalkulačka!P25","v":41065.249718356048},{"$f":"B20*Kalkulačka!Q25","v":6176.8893395218001},6176.8893395218001,{"$f":"F20+G20","v":4550.7144050904999},4406.2249313418997,144.48947374860001,{"$f":"I20+J20","v":1626.1749344313},1581.8000012984,44.374933132900004,{"$f":"IF(K6<(C20-D20),K6,(C20-D20))","v":0},{"$f":"K20-O20","v":0},{"$f":"L20*(M6/L6)","v":0},{"$f":"L20*(N6/L6)","v":0},{"$f":"IF(K20*(1-Kalkulačka!$R25)<O6,IF(K20*Kalkulačka!$R25>L6,K20-L6,K20*(1-Kalkulačka!$R25)),O6)","v":0},null,{"$f":"O20*(Q6/O6)","v":0},{"$f":"O20*(R6/O6)","v":0},{"$f":"IF(S6<(C20-D20-K20),S6,(C20-D20-K20))","v":0},{"$f":"S20-W20","v":0},{"$f":"T20*(U6/T6)","v":0},{"$f":"T20*(V6/T6)","v":0},{"$f":"IF(S20*(1-Kalkulačka!$R25)<W6,IF(S20*Kalkulačka!$R25>T6,S20-T6,S20*(1-Kalkulačka!$R25)),W6)","v":0},null,{"$f":"W20*(Y6/W6)","v":0},{"$f":"W20*(Z6/W6)","v":0},{"$f":"IF(AA6<(C20-D20-K20-S20),AA6,(C20-D20-K20-S20))","v":0},{"$f":"AA20-AE20","v":0},{"$f":"AB20*(AC6/AB6)","v":0},{"$f":"AB20*(AD6/AB6)","v":0},{"$f":"IF(AA20*(1-Kalkulačka!$R25)<AE6,IF(AA20*Kalkulačka!$R25>AB6,AA20-AB6,AA20*(1-Kalkulačka!$R25)),AE6)","v":0},null,{"$f":"AE20*(AG6/AE6)","v":0},{"$f":"AE20*(AH6/AE6)","v":0},{"$f":"F20+M20+U20+AC20","v":4406.2249313418997},{"$f":"G20+N20+V20+AD20","v":144.48947374860001},{"$f":"I20+Q20+Y20+AG20","v":1581.8000012984},{"$f":"J20+R20+Z20+AH20","v":44.374933132900004}]
{"$rows_left_out":37}
{"sheet":"Formy","index":2,"n_rows":50,"n_cols":18,"rows_kept":50,"cut":false,"hidden":false,"merged":[[42,1,42,2],[43,1,43,2],[37,1,37,2],[38,1,38,2],[39,1,39,2],[40,1,40,2],[41,1,41,2],[33,1,33,2],[27,1,27,2],[28,1,28,2],[29,1,29,2],[30,1,30,2],[31,1,31,2],[32,1,32,2]]}
["Rozloha A zón",1]
["Terajší stav",null,null,1,0.15041645629542461,0.1532377126654545,7.4527363634713073E-2,0.42259542849206089,0.19519192136870092,6.1132977295850786E-2,0.12340393187857278,3.5035913787433988E-2,0.2412064585736475]
["+ nová zonácia TANAPu",null,null,2,0.15041645629542461,0.1532377126654545,7.4527363634713073E-2,0.56690945941157045,0.19519192136870092,6.1132977295850786E-2,0.12340393187857278,3.5035913787433988E-2,0.2412064585736475]
["25 %",null,null,3,0.25,0.25,0.25,0.56690945941157045,0.25,0.25,0.25,0.25,0.25]
["50 %",null,null,4,0.5,0.5,0.5,0.56690945941157045,0.5,0.5,0.5,0.5,0.5]
["75 %",null,null,5,0.75,0.75,0.75,0.75,0.75,0.75,0.75,0.75,0.75]
[]
["Preferencia štátny vs. neštátny vlastník",2]
["15:85",null,null,1,0.85]
["50:50",null,null,2,0.5]
["85:15",null,null,3,0.15]
[]
["Rozloha národných parkov",2]
["125 %",null,null,1,1.25]
["100 %",null,null,2,1]
["75 %",null,null,3,0.75]
["50 %",null,null,4,0.5]
[]
["Veľkosť nárazníkovej zóny (m)",2]
["1000 m",null,null,1,100,-0.51100000000000001]
{"$rows_left_out":31}
{"sheet":"Porovnanie alternatív","index":3,"n_rows":102,"n_cols":15,"rows_kept":102,"cut":false,"hidden":false,"merged":[[2,5,3,5],[4,5,10,5]]}
[null,"Nájmy","Výkupy","Zámeny"]
[0,{"$f":"$H$3+$H$4+H11","v":3294641.5386109203},{"$f":"$I$3+$I$4+I11","v":74469493.968081236},{"$f":"$J$3+$J$4+J11","v":2387266.8285907861},null,null,null,"Nájmy","Výkupy","Zámeny"]
[1,{"$f":"B2+$H$11/(1+Kalkulačka!$Q$9)^A3","v":5999601.9909953773},{"$f":"C2+$I$11/(1+Kalkulačka!$Q$9)^A3","v":75969246.506422162},{"$f":"D2+$J$11/(1+Kalkulačka!$Q$9)^A3","v":4228060.8904798767},null,"Jednorazové náklady","Poplatky",{"$f":"Kalkulačka!$E$11","v":454433.06360724097},{"$f":"Kalkulačka!$E$11","v":454433.06360724097},{"$f":"Kalkulačka!$E$11","v":454433.06360724097},null,null,"Strata obcí","Strata štátneho rozpočtu","Strata ŠP"]
[2,{"$f":"B3+$H$11/(1+Kalkulačka!$Q$9)^A4","v":8575754.8027900979},{"$f":"C3+$I$11/(1+Kalkulačka!$Q$9)^A4","v":77397582.25722304},{"$f":"D3+$J$11/(1+Kalkulačka!$Q$9)^A4","v":5981198.0922790105},null,null,"Výkup",0,{"$f":"Kalkulačka!K34","v":72440320.739216015},0,null,"Veľká Fatra",{"$f":"(Kalkulačka!F40+Kalkulačka!G40)*(Kalkulačka!$U$5-Kalkulačka!$T$5)","v":8130.8746721565003},{"$f":"(Kalkulačka!F40+Kalkulačka!G40)*(Kalkulačka!$Q$4-Kalkulačka!$T$4)","v":9594.4321131446686},{"$f":"(Kalkulačka!F40-Podklady!I6)*Kalkulačka!$Q$4","v":0}]
[3,{"$f":"B4+$H$11/(1+Kalkulačka!$Q$9)^A5","v":11029233.671166021},{"$f":"C4+$I$11/(1+Kalkulačka!$Q$9)^A5","v":78757902.019890547},{"$f":"D4+$J$11/(1+Kalkulačka!$Q$9)^A5","v":7650852.5701829474},null,"Každoročné platby","Nájom",{"$f":"Kalkulačka!E4","v":1265468.3097457041},0,0,null,"Nízke Tatry",{"$f":"(Kalkulačka!F41+Kalkulačka!G41)*(Kalkulačka!$U$5-Kalkulačka!$T$5)","v":42444.907338702993},{"$f":"(Kalkulačka!F41+Kalkulačka!G41)*(Kalkulačka!$Q$4-Kalkulačka!$T$4)","v":50084.990659669522},{"$f":"(Kalkulačka!F41-Podklady!I7)*Kalkulačka!$Q$4","v":0}]
[4,{"$f":"B5+$H$11/(1+Kalkulačka!$Q$9)^A6","v":13365880.212476425},{"$f":"C5+$I$11/(1+Kalkulačka!$Q$9)^A6","v":80053444.651002467},{"$f":"D5+$J$11/(1+Kalkulačka!$Q$9)^A6","v":9240999.6919962205},null,null,"Zmluvná starostlivosť",{"$f":"Kalkulačka!$E$5","v":1574740.165257975},{"$f":"Kalkulačka!$E$5","v":1574740.165257975},{"$f":"Kalkulačka!$E$5","v":1574740.165257975},null,"PIENAP",{"$f":"(Kalkulačka!F42+Kalkulačka!G42)*(Kalkulačka!$U$5-Kalkulačka!$T$5)","v":245.59914498550015},{"$f":"(Kalkulačka!F42+Kalkulačka!G42)*(Kalkulačka!$R$4-Kalkulačka!$T$4)","v":830.12511005099043},{"$f":"(Kalkulačka!F42-Podklady!I8)*Kalkulačka!$R$4","v":8.2067685980291571E-13}]
[5,{"$f":"B6+$H$11/(1+Kalkulačka!$Q$9)^A7","v":15591257.870867286},{"$f":"C6+$I$11/(1+Kalkulačka!$Q$9)^A7","v":81287294.775870949},{"$f":"D6+$J$11/(1+Kalkulačka!$Q$9)^A7","v":10755425.522294575},null,null,"Daň obce",{"$f":"Kalkulačka!$E$7","v":-1.7205792346430826E-11},{"$f":"Kalkulačka!$E$7","v":-1.7205792346430826E-11},{"$f":"Kalkulačka!$E$7+M13","v":126024.92563333396},null,"TANAP",{"$f":"(Kalkulačka!F43+Kalkulačka!G43)*(Kalkulačka!$U$5-Kalkulačka!$T$5)","v":40525.168990700491},{"$f":"(Kalkulačka!F43+Kalkulačka!G43)*(Kalkulačka!$R$4-Kalkulačka!$T$4)","v":136975.07118856764},{"$f":"(Kalkulačka!F43-Podklady!I9)*Kalkulačka!$R$4","v":-7.0031092036515474E-11}]
[6,{"$f":"B7+$H$11/(1+Kalkulačka!$Q$9)^A8","v":17710665.164572868},{"$f":"C7+$I$11/(1+Kalkulačka!$Q$9)^A8","v":82462390.132888556},{"$f":"D7+$J$11/(1+Kalkulačka!$Q$9)^A8","v":12197735.836864438},null,null,"Strata ŠP",{"$f":"Kalkulačka!$E$8","v":-6.6251004682271748E-12},{"$f":"Kalkulačka!$E$8","v":-6.6251004682271748E-12},{"$f":"Kalkulačka!$E$8+O13","v":-7.583551564493973E-11},null,"Malá Fatra",{"$f":"(Kalkulačka!F44+Kalkulačka!G44)*(Kalkulačka!$U$5-Kalkulačka!$T$5)","v":16916.798196839496},{"$f":"(Kalkulačka!F44+Kalkulačka!G44)*(Kalkulačka!$Q$4-Kalkulačka!$T$4)","v":19961.821872270601},{"$f":"(Kalkulačka!F44-Podklady!I10)*Kalkulačka!$Q$4","v":0}]
[7,{"$f":"B8+$H$11/(1+Kalkulačka!$Q$9)^A9","v":19729148.301435329},{"$f":"C8+$I$11/(1+Kalkulačka!$Q$9)^A9","v":83581528.568143427},{"$f":"D8+$J$11/(1+Kalkulačka!$Q$9)^A9","v":13571364.707883354},null,null,"Daň rozpočet",{"$f":"Kalkulačka!$E$34","v":-1.0776659564726288E-10},{"$f":"Kalkulačka!$E$34","v":-1.0776659564726288E-10},{"$f":"Kalkulačka!$E$34+N13","v":232068.67409223653},null,"Poloniny",{"$f":"(Kalkulačka!F45+Kalkulačka!G45)*(Kalkulačka!$U$5-Kalkulačka!$T$5)","v":3106.0921831404999},{"$f":"(Kalkulačka!F45+Kalkulačka!G45)*(Kalkulačka!$S$4-Kalkulačka!$T$4)","v":-2671.2392775008302},{"$f":"(Kalkulačka!F45-Podklady!I11)*Kalkulačka!$S$4","v":0}]
[8,{"$f":"B9+$H$11/(1+Kalkulačka!$Q$9)^A10","v":21651513.193685289},{"$f":"C9+$I$11/(1+Kalkulačka!$Q$9)^A10","v":84647374.696957588},{"$f":"D9+$J$11/(1+Kalkulačka!$Q$9)^A10","v":14879582.680282323},null,null,"Inštitucionálne zmeny",{"$f":"Kalkulačka!$F$34","v":-1.0913936421275139E-11},{"$f":"Kalkulačka!$F$34","v":-1.0913936421275139E-11},{"$f":"Kalkulačka!$F$34","v":-1.0913936421275139E-11},null,"Muránska planina",{"$f":"(Kalkulačka!F46+Kalkulačka!G46)*(Kalkulačka!$U$5-Kalkulačka!$T$5)","v":1169.6868634389998},{"$f":"(Kalkulačka!F46+Kalkulačka!G46)*(Kalkulačka!$Q$4-Kalkulačka!$T$4)","v":1380.2304988580195},{"$f":"(Kalkulačka!F46-Podklady!I12)*Kalkulačka!$Q$4","v":0}]
[9,{"$f":"B10+$H$11/(1+Kalkulačka!$Q$9)^A11","v":23482336.900590014},{"$f":"C10+$I$11/(1+Kalkulačka!$Q$9)^A11","v":85662466.248209164},{"$f":"D10+$J$11/(1+Kalkulačka!$Q$9)^A11","v":16125504.558757531},null,null,"TOTAL",{"$f":"SUM(H5:H10)","v":2840208.4750036793},{"$f":"SUM(I5:I10)","v":1574740.165257975},{"$f":"SUM(J5:J10)","v":1932833.7649835453},null,"Slovenský kras",{"$f":"(Kalkulačka!F47+Kalkulačka!G47)*(Kalkulačka!$U$5-Kalkulačka!$T$5)","v":2697.666909344},{"$f":"(Kalkulačka!F47+Kalkulačka!G47)*(Kalkulačka!$Q$4-Kalkulačka!$T$4)","v":3183.2469530259191},{"$f":"(Kalkulačka!F47-Podklady!I13)*Kalkulačka!$Q$4","v":0}]
[10,{"$f":"B11+$H$11/(1+Kalkulačka!$Q$9)^A12","v":25225978.52621356},{"$f":"C11+$I$11/(1+Kalkulačka!$Q$9)^A12","v":86629220.106544003},{"$f":"D11+$J$11/(1+Kalkulačka!$Q$9)^A12","v":17312096.823972013},null,null,null,null,null,null,null,"Slovenský raj",{"$f":"(Kalkulačka!F48+Kalkulačka!G48)*(Kalkulačka!$U$5-Kalkulačka!$T$5)","v":10788.1313340255},{"$f":"(Kalkulačka!F48+Kalkulačka!G48)*(Kalkulačka!$Q$4-Kalkulačka!$T$4)","v":12729.994974150086},{"$f":"(Kalkulačka!F48-Podklady!I14)*Kalkulačka!$Q$4","v":0}]
[11,{"$f":"B12+$H$11/(1+Kalkulačka!$Q$9)^A13","v":26886589.598235987},{"$f":"C12+$I$11/(1+Kalkulačka!$Q$9)^A13","v":87549938.066862896},{"$f":"D12+$J$11/(1+Kalkulačka!$Q$9)^A13","v":18442184.695604853},null,null,null,null,null,null,null,null,{"$f":"SUM(M4:M12)","v":126024.92563333397},{"$f":"SUM(N4:N12)","v":232068.67409223664},{"$f":"SUM(O4:O12)","v":-6.9210415176712559E-11}]
[12,{"$f":"B13+$H$11/(1+Kalkulačka!$Q$9)^A14","v":28468123.952543058},{"$f":"C13+$I$11/(1+Kalkulačka!$Q$9)^A14","v":88426812.314785644},{"$f":"D13+$J$11/(1+Kalkulačka!$Q$9)^A14","v":19518458.859064702}]
[13,{"$f":"B14+$H$11/(1+Kalkulačka!$Q$9)^A15","v":29974347.147121221},{"$f":"C14+$I$11/(1+Kalkulačka!$Q$9)^A15","v":89261930.64614065},{"$f":"D14+$J$11/(1+Kalkulačka!$Q$9)^A15","v":20543481.871883605}]
[14,{"$f":"B15+$H$11/(1+Kalkulačka!$Q$9)^A16","v":31408845.427671853},{"$f":"C15+$I$11/(1+Kalkulačka!$Q$9)^A16","v":90057281.437907323},{"$f":"D15+$J$11/(1+Kalkulačka!$Q$9)^A16","v":21519694.265044466}]
[15,{"$f":"B16+$H$11/(1+Kalkulačka!$Q$9)^A17","v":32775034.266291503},{"$f":"C16+$I$11/(1+Kalkulačka!$Q$9)^A17","v":90814758.382447004},{"$f":"D16+$J$11/(1+Kalkulačka!$Q$9)^A17","v":22449420.353769094}]
[16,{"$f":"B17+$H$11/(1+Kalkulačka!$Q$9)^A18","v":34076166.493548311},{"$f":"C17+$I$11/(1+Kalkulačka!$Q$9)^A18","v":91536164.99629432},{"$f":"D17+$J$11/(1+Kalkulačka!$Q$9)^A18","v":23334873.771602076}]
[17,{"$f":"B18+$H$11/(1+Kalkulačka!$Q$9)^A19","v":35315340.0433167},{"$f":"C18+$I$11/(1+Kalkulačka!$Q$9)^A19","v":92223218.914244145},{"$f":"D18+$J$11/(1+Kalkulačka!$Q$9)^A19","v":24178162.740966819}]
[18,{"$f":"B19+$H$11/(1+Kalkulačka!$Q$9)^A20","v":36495505.328810401},{"$f":"C19+$I$11/(1+Kalkulačka!$Q$9)^A20","v":92877555.978958264},{"$f":"D19+$J$11/(1+Kalkulačka!$Q$9)^A20","v":24981295.092742763}]
{"$rows_left_out":83}
{"sheet":"zam","index":4,"n_rows":10,"n_cols":9,"rows_kept":10,"cut":false,"hidden":false,"merged":[[1,1,1,9],[2,4,2,7],[4,8,6,8]]}
[]
[null,"VÝSLEDKY"]
[null,null,null,null,"Priemerné ročné náklady za obdobie 8 rokov"]
[null,"Podiel bezzásahu",null,"Počet nezamestnaných","Nižší výber daní a odvodov","Dávka v nezamestnanosti","Dávky v hmotnej núdzi","Spolu","Alternatíva"]
[null,0.5,null,124.64351686478226,190524.59856940864,35065.714143941252,10723.021004240372,{"$f":"SUM(E5:G5)","v":236313.33371759026},{"$f":"IF(Formy!B1<4,0,IF(Formy!B1=4,zam!H5,IF(Formy!B13=3,zam!H7,zam!H6)))","v":0}]
[null,0.75,null,154.80169314949495,236250.50222606669,43481.485538487148,13296.546045258057,{"$f":"SUM(E6:G6)","v":293028.53380981192}]
[null,"75 % + zmenšený park",null,8.0393662707833755,12193.574308442157,2244.20570521224,686.27334427138362,{"$f":"SUM(E7:G7)","v":15124.053357925781}]
[]
[]
[null,"Viac v exceli Výpočty"]